{"text_format":"1","workbook":"xlsx","n_sheets":42,"sheets":["MENUDATOS","1","G1","2","3","4","5","G2","6","7","8","9","10","11","12","13","14","15","16","17","18","19","20","21","22","23","24","25","26","27","G3","28","29","G4","30","31","32","33","34","G5","35","36"],"not_rendered":{"charts":5,"images":36,"macros":1,"external_links":0,"defined_names":12,"comments":0,"pivot_tables":0},"unopened":[],"bounds":{"document_bytes":16777216,"sheet_cells":100000,"rows_first":2000,"rows_last":500,"rows_between":2000,"halvings":0,"cell_chars":16384,"cell_head_chars":4096},"cells_cut":0,"cells_raw":0,"read":"whole","date_system":"1900"}

{"sheet":"MENUDATOS","index":0,"n_rows":56,"n_cols":3,"rows_kept":56,"cut":false,"hidden":true,"merged":[]}
["Cuadro 1","PADRÓN NACIONAL ELECTORAL TOTAL Y VARIACIÓN  SEGÚN PROVINCIA Y SEXO",1]
["Gráfico 1","PADRÓN NACIONAL ELECTORAL, POR PROCESO ELECTORAL, SEGÚN PROVINCIA","G1"]
["Cuadro 2","COMPARATIVO PADRÓN ELECTORAL, FEBRERO 2018 Y 2022 ",2]
["Cuadro 3","PADRÓN NACIONAL ELECTORAL, POR SEXO, SEGÚN PROVINCIA, CANTÓN Y DISTRITO",3]
["Cuadro 4","PADRÓN NACIONAL ELECTORAL, POR GRUPOS DE EDAD SEGÚN PROVINCIA, CANTÓN Y DISTRITO",4]
["Cuadro 5","ELECTORADO POR PROVINCIA , SEGÚN SEXO Y GRUPOS DE EDAD",5]
["Gráfico 2","DISTRIBUCIÓN DEL PADRÓN ELECTORAL POR SEXO Y GRUPOS DE EDAD","G2"]
["Cuadro 6","ELECTORADO EN EL EXTRANJERO POR SEXO SEGÚN UBICACIÓN GEOGRÁFICA Y PAÍS",6]
{"$rows_left_out":49}
{"sheet":"1","index":1,"n_rows":39,"n_cols":5,"rows_kept":39,"cut":false,"hidden":false,"merged":[[37,0,37,4],[5,0,7,0],[5,3,6,4],[5,1,6,2]]}
[]
["CUADRO 1"]
[" COSTA RICA: TOTAL Y VARIACIÓN DEL PADRÓN NACIONAL ELECTORAL"]
["SEGÚN PROVINCIA Y SEXO, DE FEBRERO 2018 A FEBRERO 2022"]
[]
["PROVINCIA Y SEXO","PADRÓN NACIONAL ELECTORAL",null,"VARIACIÓN "]
[]
[null," FEBRERO 2018"," FEBRERO 2022","ABSOLUTO","%"]
{"$rows_left_out":32}
{"sheet":"G1","index":2,"n_rows":45,"n_cols":12,"rows_kept":45,"cut":false,"hidden":false,"merged":[[21,9,27,9],[28,9,28,10],[17,9,17,13],[18,9,18,13],[19,9,20,10],[19,11,19,12],[19,13,20,13]]}
[]
[]
[]
[null,null,null,null,null,null,null,null,null," ",2018,2022]
[]
[null,null,null,null,null,null,null,null,null,"EXTRANJERO",31864,{"$f":"+'1'!C33","v":50833}]
[null,null,null,null,null,null,null,null,null,"GUANACASTE",240637,{"$f":"+'1'!C24","v":259988}]
[null,null,null,null,null,null,null,null,null,"LIMÓN",272633,{"$f":"+'1'!C30","v":294954}]
{"$rows_left_out":38}
{"sheet":"2","index":3,"n_rows":113,"n_cols":7,"rows_kept":113,"cut":false,"hidden":false,"merged":[[5,0,7,0]]}
[]
["CUADRO 2"]
["   COSTA RICA: PADRÓN NACIONAL ELECTORAL, POR SEXO, SEGÚN PROVINCIA, CANTÓN"]
["   Y EXTRANJERO, FEBRERO DE 2018 Y 2022"]
[]
["PROVINCIA, CANTÓN Y EXTRANJERO","PADRÓN NACIONAL ELECTORAL"]
[null," FEBRERO 2018",null,null," FEBRERO 2022"]
[null,"TOTAL","HOMBRES","MUJERES","TOTAL","HOMBRES","MUJERES"]
{"$rows_left_out":106}
{"sheet":"3","index":4,"n_rows":632,"n_cols":6,"rows_kept":632,"cut":false,"hidden":false,"merged":[[1,0,1,5],[5,0,6,0],[5,1,6,1],[5,2,5,5],[3,0,3,5],[2,0,2,5]]}
[]
["CUADRO 3"]
["   COSTA RICA:  PADRÓN NACIONAL ELECTORAL, POR SEXO, SEGÚN PROVINCIA, CANTÓN\n DISTRITO ADMINISTRATIVO Y PAÍSES EN EL EXTRANJERO\nELECCIONES PRESIDENCIALES FEBRERO 2022"]
["(Cifras absolutas y relativas)"]
[]
["PROVINCIA, CANTÓN, DISTRITO ADMINISTRATIVO Y PAÍSES EN EL EXTRANJERO","TOTAL","SEXO"]
[null,null,"HOMBRES","%","MUJERES","%"]
[]
{"$rows_left_out":625}
{"sheet":"4","index":5,"n_rows":630,"n_cols":11,"rows_kept":630,"cut":false,"hidden":false,"merged":[[1,0,1,10],[2,0,2,10],[4,0,5,0],[4,1,5,1],[4,2,4,10]]}
[]
["CUADRO 4"]
["   COSTA RICA:  PADRÓN NACIONAL ELECTORAL, POR GRUPOS DECENALES DE EDAD, SEGÚN PROVINCIA, CANTÓN\n DISTRITO ADMINISTRATIVO Y PAÍSES EN EL EXTRANJERO\nELECCIONES PRESIDENCIALES FEBRERO 2022"]
[]
["PROVINCIA, CANTÓN, DISTRITO ADMINISTRATIVO Y PAÍSES \nEN EL EXTRANJERO","TOTAL","GRUPOS DECENALES DE EDAD"]
[null,null,"Menos de 30","De 30 a 39","De 40 a 49","De 50 a 59","De 60 a 69","De 70 a 79","De 80 a 89","De 90 a 99","100 y Más"]
["COSTA RICA",{"$f":"+B8+B152+B285+B345+B403+B476+B548+B585","v":3541908},886121,777658,608257,539179,410524,212128,87432,19725,884]
["PROVINCIA: SAN JOSÉ",1157828,273607,250359,196071,176533,143361,77759,32144,7659,335]
{"$rows_left_out":623}
{"sheet":"5","index":6,"n_rows":68,"n_cols":10,"rows_kept":68,"cut":false,"hidden":false,"merged":[[5,0,6,0],[5,1,6,1],[5,2,5,8],[5,9,6,9]]}
[]
["CUADRO 5"]
[" COSTA RICA: PADRÓN NACIONAL ELECTORAL, POR PROVINCIA Y EXTRANJERO, SEGÚN SEXO "]
["Y GRUPOS DE EDAD, ELECCIONES 6 DE FEBRERO DE 2022"]
[]
["SEXO Y GRUPOS DE EDAD","TOTAL","PROVINCIA",null,null,null,null,null,null,"EXTRANJERO"]
[null,null,"SAN JOSÉ","ALAJUELA","CARTAGO","HEREDIA","GUANACASTE","PUNTARENAS","LIMÓN"]
[]
{"$rows_left_out":61}
{"sheet":"G2","index":7,"n_rows":46,"n_cols":12,"rows_kept":46,"cut":false,"hidden":false,"merged":[[44,8,44,9]]}
[]
[]
[]
[null,null,null,null,null,null,null,null,"HOMBRES","MUJERES"]
[null,null,null,null,null,null,null,null,{"$f":"+'5'!B29","v":59429},{"$f":"+'5'!B48*-1","v":-57644},"18 - 19","18 - 19                                                           "]
[null,null,null,null,null,null,null,null,{"$f":"+'5'!B30","v":192230},{"$f":"+'5'!B49*-1","v":-184680},"20 - 24","20 - 24                                                           "]
[null,null,null,null,null,null,null,null,{"$f":"+'5'!B31","v":199410},{"$f":"+'5'!B50*-1","v":-192728},"25 - 29","25 - 29                                                           "]
[null,null,null,null,null,null,null,null,{"$f":"+'5'!B32","v":201268},{"$f":"+'5'!B51*-1","v":-195077},"30 - 34","30 - 34                                                           "]
{"$rows_left_out":39}
{"sheet":"6","index":8,"n_rows":63,"n_cols":7,"rows_kept":63,"cut":false,"hidden":false,"merged":[[5,0,6,0],[61,0,61,6]]}
[]
["CUADRO 6"]
["COSTA RICA: ELECTORADO EN EL EXTRANJERO 1/ POR SEXO, SEGÚN UBICACIÓN GEOGRÁFICA Y PAÍS"]
["ELECCIONES 6 DE FEBRERO 2022"]
[]
["Ubicación Geográfica\n y país","Total",null,"Hombres",null,"Mujeres"]
[null,"Absoluto","%","Absoluto","%","Absoluto","%"]
[]
{"$rows_left_out":56}
{"sheet":"7","index":9,"n_rows":66,"n_cols":7,"rows_kept":66,"cut":false,"hidden":false,"merged":[[5,0,6,0],[64,0,64,6]]}
[]
["CUADRO 7"]
["COSTA RICA: ELECTORADO EN EL EXTRANJERO1/"]
["POR SEXO, SEGÚN CONSULADO, ELECCIONES 6 DE FEBRERO 2022"]
[]
["Consulado","Total",null,"Hombres",null,"Mujeres"]
[null,"Absoluto","%","Absoluto","%","Absoluto","%"]
[]
{"$rows_left_out":59}
{"sheet":"8","index":10,"n_rows":41,"n_cols":13,"rows_kept":41,"cut":false,"hidden":false,"merged":[[2,0,2,12],[3,0,3,12],[5,0,6,0],[5,1,5,12]]}
[]
["CUADRO 8"]
["COSTA RICA: TOTAL DE ELECTORES NATURALIZADOS, POR PAÍS DE ORIGEN"]
["SEGÚN SEXO Y GRUPOS DE EDAD, ELECCIONES 6 DE FEBRERO DE 2022"]
[]
["SEXO Y GRUPOS DE EDAD","PAÍS DE ORIGEN"]
[null,"Total","Nicaragua","Colombia","El Salvador","Cuba","China","Perú","Panamá","República Dominicana","Venezuela","Estados Unidos","Resto de países"]
[]
{"$rows_left_out":34}
{"sheet":"9","index":11,"n_rows":113,"n_cols":10,"rows_kept":113,"cut":false,"hidden":false,"merged":[[1,0,1,9],[5,1,5,3],[5,4,5,6],[5,7,5,9],[5,0,6,0],[2,0,2,9],[3,0,3,9]]}
[]
["CUADRO 9"]
["   COSTA RICA: PROMEDIO, MEDIANA Y MODA1/ DE LA EDAD DEL ELECTORADO, POR  SEXO, SEGÚN PROVINCIA"]
[" CANTÓN Y EXTRANJERO, ELECCIONES 6 DE FEBRERO DE 2022"]
[]
["PROVINCIA, CANTÓN Y EXTRANJERO","TOTAL",null,null,"HOMBRES",null,null,"MUJERES"]
[null,"PROMEDIO","MEDIANA","MODA","PROMEDIO","MEDIANA","MODA","PROMEDIO","MEDIANA","MODA"]
["COSTA RICA",43.844621317096838,41,36,43.321528524498298,41,36,44.361556584312339,42,36]
{"$rows_left_out":106}
{"sheet":"10","index":12,"n_rows":15,"n_cols":6,"rows_kept":15,"cut":false,"hidden":false,"merged":[[0,0,0,5],[1,0,1,5],[12,0,12,5]]}
["CUADRO 10"]
["COSTA RICA:  NUEVOS ELECTORES 1/ POR SEXO,  SEGÚN EDAD AL 6 DE  FEBRERO \n ELECCIONES 6 DE FEBRERO 2022"]
[]
["EDAD","TOTAL","HOMBRES","%","MUJERES","%"]
[]
["TOTAL",{"$f":"SUM(B7:B16)","v":126525},{"$f":"SUM(C7:C16)","v":63363},{"$f":"+C6/B6*100","v":50.079430942501482},{"$f":"SUM(E7:E16)","v":63162},{"$f":"+E6/B6*100","v":49.920569057498518}]
["18 AÑOS",{"$f":"+C7+E7","v":49126},24507,49.886007409518378,24619,50.113992590481615]
["19 AÑOS",{"$f":"+C8+E8","v":67598},34750,51.406846356401083,32848,{"$f":"+E8/B8*100","v":48.593153643598924}]
{"$rows_left_out":8}
{"sheet":"11","index":13,"n_rows":23,"n_cols":4,"rows_kept":23,"cut":false,"hidden":false,"merged":[[5,0,6,0],[5,1,6,1],[19,0,19,3]]}
[]
["CUADRO 11"]
[" COSTA RICA: CANTONES, DISTRITOS ADMINISTRATIVOS Y ELECTORALES"]
["SEGÚN PROVINCIA, ELECCIONES 6 DE FEBRERO DE 2022"]
[]
["PROVINCIA","CANTONES","DISTRITOS"]
[null,null,"ADMINISTRATIVOS","ELECTORALES"]
[]
{"$rows_left_out":16}
{"sheet":"12","index":14,"n_rows":22,"n_cols":5,"rows_kept":22,"cut":false,"hidden":false,"merged":[[2,0,2,4],[3,0,3,4],[1,0,1,4],[5,2,5,4],[5,0,6,0],[5,1,6,1]]}
[]
["CUADRO 12"]
[" COSTA RICA: MOVIMIENTOS DE DISTRITOS ELECTORALES EN LA DIVISIÓN TERRITORIAL ELECTORAL"]
["SEGÚN PROVINCIA, ELECCIONES 6 DE FEBRERO DE 2022"]
[]
["PROVINCIA","DISTRITOS ADMINISTRATIVOS CREADOS","DISTRITOS ELECTORALES"]
[null,null,"CREADOS","REUBICADOS","MODIFICADOS"]
[]
{"$rows_left_out":15}
{"sheet":"13","index":15,"n_rows":19,"n_cols":6,"rows_kept":19,"cut":false,"hidden":false,"merged":[[1,0,1,5],[2,0,2,5],[3,0,3,5],[5,0,6,0],[5,1,5,5]]}
[]
["CUADRO 13"]
[" COSTA RICA: MOVIMIENTOS DE POBLADOS EN LA DIVISIÓN TERRITORIAL ELECTORAL"]
["SEGÚN PROVINCIA, ELECCIONES 6 DE FEBRERO DE 2022"]
[]
["PROVINCIA","POBLADOS"]
[null,"TOTAL","INCLUIDOS","REUBICADOS","MODIFICADOS","ELIMINADOS"]
[]
{"$rows_left_out":12}
{"sheet":"14","index":16,"n_rows":21,"n_cols":4,"rows_kept":21,"cut":false,"hidden":false,"merged":[[20,0,20,3],[19,0,19,3],[1,0,1,3],[2,0,2,3],[3,0,3,3],[4,0,4,3]]}
[]
["CUADRO 14"]
[" COSTA RICA: CENTROS DE VOTACIÓN, JUNTAS RECEPTORAS Y"]
["CENTROS DE TRANSMISIÓN, SEGÚN PROVINCIA"]
["ELECCIONES 6 DE FEBRERO DE 2022"]
[]
["PROVINCIA","CENTROS DE VOTACIÓN1/","JUNTAS\nRECEPTORAS","CENTROS DE TRANSMISIÓN 1/"]
[]
{"$rows_left_out":14}
{"sheet":"15","index":17,"n_rows":19,"n_cols":9,"rows_kept":19,"cut":false,"hidden":false,"merged":[[6,3,6,4],[1,0,1,8],[2,0,2,8],[3,0,3,8],[4,0,4,8],[6,7,6,8],[6,0,7,0],[6,1,6,2],[6,5,6,6]]}
[]
["CUADRO 15"]
[" COSTA RICA: JUNTAS RECEPTORAS Y ELECTORADO EN CENTROS ATENCIÓN INSTITUCIONAL, HOGARES DE"]
["LARGA ESTANCIA, ZONAS INDÍGENAS Y CENTROS DE SALUD MENTAL, SEGÚN PROVINCIA"]
[" ELECCIONES 6 DE FEBRERO DE 2022"]
[]
["PROVINCIA","HOGARES DE LARGA ESTANCIA",null,"CENTROS  DE ATENCIÓN INSTITUCIONAL",null,"ZONAS INDÍGENAS",null,"CENTROS DE SALUD MENTAL"]
[null,"JUNTAS","ELECTORADO","JUNTAS","ELECTORADO","JUNTAS","ELECTORADO","JUNTAS","ELECTORADO"]
{"$rows_left_out":12}
{"sheet":"16","index":18,"n_rows":69,"n_cols":5,"rows_kept":69,"cut":false,"hidden":false,"merged":[[68,0,68,4],[5,0,6,0],[5,2,5,4],[5,1,6,1],[1,0,1,4],[2,0,2,4],[3,0,3,4]]}
[]
["CUADRO 16"]
[" COSTA RICA: JUNTAS RECEPTORAS Y ELECTORADO EN HOGARES DE LARGA ESTANCIA,  POR SEXO"]
["SEGÚN PROVINCIA Y DISTRITO ELECTORAL, ELECCIONES 6 DE FEBRERO DE 2022"]
[]
["PROVINCIA Y DISTRITO ELECTORAL","NÚMERO DE JUNTAS","ELECTORADO"]
[null,null,"TOTAL","HOMBRES","MUJERES"]
[]
{"$rows_left_out":62}
{"sheet":"17","index":19,"n_rows":43,"n_cols":5,"rows_kept":43,"cut":false,"hidden":false,"merged":[[42,0,42,4],[1,0,1,4],[2,0,2,4],[3,0,3,4],[4,0,4,2],[5,0,6,0],[5,1,6,1],[5,2,5,4]]}
[]
["CUADRO 17"]
["COSTA RICA: JUNTAS RECEPTORAS Y ELECTORADO EN CENTROS DE ATENCIÓN INSTITUCIONAL"]
["POR SEXO, SEGÚN PROVINCIA Y DISTRITO ELECTORAL, ELECCIONES 6 DE FEBRERO DE 2022"]
[]
["PROVINCIA Y DISTRITO ELECTORAL","NÚMERO DE JUNTAS","ELECTORADO"]
[null,null,"TOTAL","HOMBRES","MUJERES"]
["COSTA RICA",{"$f":"+B9+B14+B26+B28+B30+B34+B37","v":27.000000000000007},{"$f":"+C9+C14+C26+C28+C30+C34+C37","v":8594},{"$f":"+D9+D14+D26+D28+D30+D34+D37","v":8338},{"$f":"+E9+E14+E26+E28+E30+E34+E37","v":256}]
{"$rows_left_out":36}
{"sheet":"18","index":20,"n_rows":94,"n_cols":5,"rows_kept":94,"cut":false,"hidden":false,"merged":[[93,0,93,4],[1,0,1,4],[2,0,2,4],[3,0,3,4],[4,0,4,2],[5,0,6,0],[5,1,6,1],[5,2,5,4]]}
[]
["CUADRO 18"]
[" COSTA RICA: JUNTAS RECEPTORAS Y ELECTORADO EN ZONAS INDÍGENAS, POR SEXO"]
["SEGÚN PROVINCIA Y DISTRITO ELECTORAL, ELECCIONES 6 DE FEBRERO DE 2022"]
[]
["PROVINCIA Y DISTRITO ELECTORAL","NÚMERO DE JUNTAS","ELECTORADO"]
[null,null,"TOTAL","HOMBRES","MUJERES"]
[]
{"$rows_left_out":87}
{"sheet":"19","index":21,"n_rows":13,"n_cols":5,"rows_kept":13,"cut":false,"hidden":false,"merged":[[1,0,1,4],[2,0,2,4],[12,0,12,4],[3,0,3,2],[4,0,5,0],[4,1,5,1],[4,2,4,4]]}
[]
["CUADRO 19"]
[" COSTA RICA: JUNTAS RECEPTORAS Y ELECTORADO EN CENTROS DE SALUD MENTAL, POR SEXO, SEGÚN PROVINCIA Y DISTRITO ELECTORAL, ELECCIONES 6 DE FEBRERO DE 2022"]
[]
["PROVINCIA Y DISTRITO ELECTORAL","NÚMERO DE JUNTAS","ELECTORADO"]
[null,null,"TOTAL","HOMBRES","MUJERES"]
[]
["COSTA RICA",1.0000000000000002,111,110,1]
{"$rows_left_out":6}
{"sheet":"20","index":22,"n_rows":31,"n_cols":6,"rows_kept":31,"cut":false,"hidden":false,"merged":[[1,0,1,5],[2,0,2,5],[3,0,3,5],[6,0,7,0],[30,0,30,5],[4,0,4,5],[6,1,7,1],[6,2,6,3],[6,4,6,5]]}
[]
["CUADRO 20"]
["COSTA RICA: CONFORMACIÓN DE LAS JUNTAS CANTONALES POR SEXO"]
["SEGÚN PARTIDO POLÍTICO, ELECCIONES 6 DE FEBRERO 2022"]
["(CIFRAS ABSOLUTAS Y RELATIVAS)"]
[]
["PARTIDO POLÍTICO","TOTAL","HOMBRES",null,"MUJERES"]
[null,null,"ABSOLUTO","%","ABSOLUTO","%"]
{"$rows_left_out":24}
{"sheet":"21","index":23,"n_rows":30,"n_cols":9,"rows_kept":30,"cut":false,"hidden":false,"merged":[[29,0,29,5],[1,0,1,8],[2,0,2,8],[3,0,3,8],[5,0,6,0],[5,1,6,1],[5,2,5,8]]}
[]
["CUADRO 21"]
["COSTA RICA: CONFORMACIÓN DE LAS JUNTAS CANTONALES POR PROVINCIA"]
["SEGÚN PARTIDO POLÍTICO, ELECCIONES 6 DE FEBRERO 2022"]
[]
["PARTIDO POLÍTICO","COSTA RICA","PROVINCIA"]
[null,null,"SAN JOSÉ","ALAJUELA","CARTAGO","HEREDIA","GUANACASTE","PUNTARENAS","LIMÓN"]
[]
{"$rows_left_out":23}
{"sheet":"22","index":24,"n_rows":48,"n_cols":2,"rows_kept":48,"cut":false,"hidden":false,"merged":[[1,0,1,1]]}
[]
["CUADRO 22"]
["COSTA RICA: PARTIDOS POLÍTICOS QUE PARTICIPAN EN LAS ELECCIONES"]
["SEGÚN ESCALA, ELECCIONES 6 DE FEBRERO 2022"]
[]
["NOMBRE","DIVISA"]
[]
["ESCALA NACIONAL"]
{"$rows_left_out":41}
{"sheet":"23","index":25,"n_rows":19,"n_cols":2,"rows_kept":19,"cut":false,"hidden":false,"merged":[[6,0,7,0],[6,1,7,1]]}
[]
["CUADRO 23"]
[" COSTA RICA: MONTO PRESUPUESTADO POR EL TRIBUNAL SUPREMO DE ELECCIONES "]
["PARA LAS ELECCIONES GENERALES DE 2022, SEGÚN AÑO "]
["(CIFRAS EN COLONES)"]
[]
["AÑO","MONTO PRESUPUESTADO"]
[]
{"$rows_left_out":12}
{"sheet":"24","index":26,"n_rows":18,"n_cols":2,"rows_kept":18,"cut":false,"hidden":false,"merged":[[0,0,0,1],[1,0,1,1],[2,0,2,1],[15,0,15,1]]}
["CUADRO 24"]
["COSTA RICA: DONACIONES REPORTADAS PARA EL PROCESO ELECTORAL 2018-2022 1/ "]
["SEGÚN AÑO, AL 30 DE NOVIEMBRE DE 2021"]
[]
["AÑO","MONTO"]
[]
["TOTAL ",{"$f":"B8+B9+B10+B11","v":2503342855.98}]
[2018,722857396.36999977]
{"$rows_left_out":11}
{"sheet":"25","index":27,"n_rows":83,"n_cols":5,"rows_kept":83,"cut":false,"hidden":false,"merged":[[1,0,1,4],[2,0,2,4],[3,0,3,4],[4,0,4,4],[5,0,6,0],[5,1,6,1],[5,4,6,4],[5,2,5,3]]}
[]
["CUADRO 25"]
["COSTA RICA: DONACIONES EN EFECTIVO REPORTADAS ANTE EL TRIBUNAL SUPREMO DE ELECCIONES"]
["SEGÚN PARTIDO POLÍTICO  1/"]
["(Cifras en colones, al 30 de noviembre de 2021 )"]
["PARTIDO POLÍTICO ","CICLO MUNICIPAL2/","CICLO PRESIDENCIAL",null,"Octubre, 2021"]
[null,null,"PERIODO NO ELECTORAL\n2020-2021 3/","PERIODO ELECTORAL\n2021-2022 4/"]
[]
{"$rows_left_out":76}
{"sheet":"26","index":28,"n_rows":19,"n_cols":6,"rows_kept":19,"cut":false,"hidden":false,"merged":[[17,0,17,1],[1,0,1,5],[2,0,2,5],[3,0,3,5],[14,0,14,5],[16,0,16,5]]}
[]
["CUADRO 26"]
["COSTA RICA: FISCALIZACIÓN DE LOS PARTIDOS POLÍTICOS, POR AÑO"]
["SEGÚN TIPO DE FISCALIZACIÓN 1/, AL 30 DE NOVIEMBRE DE 2021"]
[]
["TIPO DE FISCALIZACIÓN","TOTAL",2018,2019,2020,2021]
[]
["TOTAL ",{"$f":"SUM(B9:B12)","v":253},{"$f":"SUM(C9:C12)","v":38},{"$f":"SUM(D9:D12)","v":51},{"$f":"SUM(E9:E12)","v":55},{"$f":"SUM(F9:F12)","v":109}]
{"$rows_left_out":12}
{"sheet":"27","index":29,"n_rows":17,"n_cols":6,"rows_kept":17,"cut":false,"hidden":false,"merged":[[1,0,1,5],[6,0,7,0],[6,1,7,1],[6,2,6,3],[6,4,6,5]]}
[]
["CUADRO 27"]
[" COSTA RICA: COMPOSICIÓN DE LAS PAPELETAS, POR SEXO, SEGÚN   "]
["TIPO DE CANDIDATURA, ELECCIONES 6 DE FEBRERO DE 2022"]
["(CIFRAS ABSOLUTAS Y RELATIVAS)"]
[]
["CANDIDATURAS","TOTAL","HOMBRES",null,"MUJERES"]
[null,null,"ABSOLUTO","%","ABSOLUTO","%"]
{"$rows_left_out":10}
{"sheet":"G3","index":30,"n_rows":39,"n_cols":11,"rows_kept":39,"cut":false,"hidden":false,"merged":[]}
[]
[]
[]
[null,null,null,null,null,null,null,null,"CANDIDATURAS","HOMBRES","MUJERES"]
[]
[null,null,null,null,null,null,null,null,"TOTAL",{"$f":"SUM(J8:J11)","v":866},{"$f":"SUM(K8:K11)","v":824}]
[]
[null,null,null,null,null,null,null,null,"DIPUTACIONES",{"$f":"'27'!C14","v":820},{"$f":"'27'!E14","v":794}]
{"$rows_left_out":32}
{"sheet":"28","index":31,"n_rows":21,"n_cols":13,"rows_kept":21,"cut":false,"hidden":false,"merged":[[5,0,6,0],[5,1,5,3],[5,4,5,6],[5,7,5,9],[5,10,5,12]]}
[]
["CUADRO 28"]
["COSTA RICA: CANDIDATURAS INSCRITAS A PRESIDENCIA Y VICEPRESIDENCIAS, POR SEXO"]
["SEGÚN GRUPOS DE EDAD, ELECCIONES 6 DE FEBRERO DE 2022"]
[]
["GRUPOS DE EDAD","TOTAL",null,null,"PRESIDENCIA",null,null,"1º VICEPRESIDENCIA",null,null,"2º VICEPRESIDENCIA"]
[null,"TOTAL","HOMBRES","MUJERES","TOTAL","HOMBRES","MUJERES","TOTAL","HOMBRES","MUJERES","TOTAL","HOMBRES","MUJERES"]
[]
{"$rows_left_out":14}
{"sheet":"29","index":32,"n_rows":26,"n_cols":10,"rows_kept":26,"cut":false,"hidden":false,"merged":[[1,0,1,9],[5,0,6,0],[5,1,5,3],[5,4,5,6],[5,7,5,9]]}
[]
["CUADRO 29"]
[" COSTA RICA: CANDIDATURAS INSCRITAS A DIPUTACIONES EN PROPIEDAD Y SUPLENCIA, POR SEXO"]
["SEGÚN GRUPOS DE EDAD, ELECCIONES 6 DE FEBRERO 2022"]
[]
["GRUPOS DE EDAD","DIPUTACIONES",null,null,"EN PROPIEDAD",null,null,"EN SUPLENCIA"]
[null,"TOTAL","HOMBRES","MUJERES","TOTAL","HOMBRES","MUJERES","TOTAL","HOMBRES","MUJERES"]
[]
{"$rows_left_out":19}
{"sheet":"G4","index":33,"n_rows":45,"n_cols":15,"rows_kept":45,"cut":false,"hidden":false,"merged":[]}
[]
[]
[]
[]
[]
[]
[null,null,null,null,null,null,null,null,null,null,null,"HOMBRES","MUJERES"]
[]
{"$rows_left_out":38}
{"sheet":"30","index":34,"n_rows":50,"n_cols":16,"rows_kept":50,"cut":false,"hidden":false,"merged":[[1,0,1,15],[3,0,3,15],[4,0,4,15],[7,2,7,3],[7,4,7,5],[7,7,7,8],[2,0,2,15],[7,9,7,10],[7,12,7,13],[7,14,7,15],[6,0,8,0],[7,1,8,1],[7,6,8,6],[7,11,8,11],[6,1,6,5],[6,6,6,10],[6,11,6,15]]}
[]
["CUADRO 30"]
[" COSTA RICA: CANDIDATURAS A DIPUTACIONES EN PROPIEDAD Y SUPLENCIA, POR SEXO"]
[" SEGÚN PARTIDO, ELECCIONES 6 DE FEBRERO DE 2022"]
["(CIFRAS ABSOLUTAS Y RELATIVAS)"]
[]
["PARTIDO POLÍTICO","DIPUTACIONES",null,null,null,null,"EN PROPIEDAD",null,null,null,null,"EN SUPLENCIA"]
["PARTIDO POLITICO","TOTAL","HOMBRES",null,"MUJERES",null,"TOTAL","HOMBRES",null,"MUJERES",null,"TOTAL","HOMBRES",null,"MUJERES"]
{"$rows_left_out":43}
{"sheet":"31","index":35,"n_rows":48,"n_cols":10,"rows_kept":48,"cut":false,"hidden":false,"merged":[[1,0,1,9],[5,7,5,9],[5,0,6,0],[5,1,5,3],[5,4,5,6]]}
[]
["CUADRO 31"]
[" COSTA RICA: EDAD PROMEDIO A FEBRERO DE LAS CANDIDATURAS INSCRITAS A DIPUTACIONES EN PROPIEDAD Y SUPLENCIA"]
["POR SEXO, SEGÚN PARTIDO POLÍTICO, ELECCIONES 6 DE FEBRERO 2022"]
[]
["PARTIDO POLÍTICO","DIPUTACIONES",null,null,"EN PROPIEDAD",null,null,"EN SUPLENCIA"]
[null,"TOTAL","HOMBRES","MUJERES","TOTAL","HOMBRES","MUJERES","TOTAL","HOMBRES","MUJERES"]
[]
{"$rows_left_out":41}
{"sheet":"32","index":36,"n_rows":30,"n_cols":25,"rows_kept":30,"cut":false,"hidden":false,"merged":[[6,1,6,3],[6,4,6,6],[6,7,6,9],[6,10,6,12],[2,0,2,24],[6,0,7,0],[6,16,6,18],[6,19,6,21],[6,22,6,24],[3,0,3,24],[4,0,4,24],[6,13,6,15]]}
[]
[]
["CUADRO 32"]
["COSTA RICA: CANDIDATURAS INSCRITAS A DIPUTACIONES PROPIETARIAS, POR PROVINCIA Y SEXO"]
["SEGÚN POSICIÓN EN LA PAPELETA, ELECCIONES 6 DE FEBRERO 2022"]
[]
["POSICIÓN","COSTA RICA",null,null,"SAN JOSÉ",null,null,"ALAJUELA",null,null,"CARTAGO",null,null,"HEREDIA",null,null,"GUANACASTE",null,null,"PUNTARENAS",null,null,"LIMÓN"]
[null,"T","H","M","T","H","M","T","H","M","T","H","M","T","H","M","T","H","M","T","H","M","T","H","M"]
{"$rows_left_out":23}
{"sheet":"33","index":37,"n_rows":47,"n_cols":22,"rows_kept":47,"cut":false,"hidden":false,"merged":[[1,0,1,21],[2,0,2,21],[3,0,3,21],[5,1,5,3],[5,19,5,21],[5,4,5,6],[5,7,5,9],[5,10,5,12],[5,13,5,15],[5,16,5,18],[5,0,6,0]]}
[]
["CUADRO 33"]
["COSTA RICA: CANDIDATURAS INSCRITAS A DIPUTACIONES PROPIETARIAS, POR POSICIÓN EN LA PAPELETA Y SEXO"]
["SEGÚN PARTIDO POLÍTICO, ELECCIONES 6 DE FEBRERO 2022"]
[]
["PARTIDO POLÍTICO","Total",null,null,"1° Posición",null,null,"2° Posición",null,null,"3° Posición",null,null,"4° Posición",null,null,"5° Posición",null,null,"6°  Posición y más"]
[null,"T","H","M","T","H","M","T","H","M","T","H","M","T","H","M","T","H","M","T","H","M"]
["TOTAL",{"$f":"SUM(B9:B44)","v":1402},{"$f":"SUM(C9:C44)","v":712},690,186,101,85,184,85,99,182,98,84,177,81,96,143,84,59,530,263,267]
{"$rows_left_out":40}
{"sheet":"34","index":38,"n_rows":37,"n_cols":6,"rows_kept":37,"cut":false,"hidden":false,"merged":[[1,0,1,5],[2,0,2,5],[6,0,8,0],[6,1,8,1]]}
[]
["CUADRO 34"]
["  COSTA RICA: CANDIDATURAS A DIPUTACIONES EN PROPIEDAD Y SUPLENCIA, POR SEXO"]
["  SEGÚN PROVINCIA, ELECCIONES 6 DE FEBRERO DE 2022"]
["(CIFRAS ABSOLUTAS Y RELATIVAS)"]
[]
["PROVINCIA","TOTAL","DIPUTACIONES"]
[null,null,"HOMBRES",null,"MUJERES"]
{"$rows_left_out":30}
{"sheet":"G5","index":39,"n_rows":42,"n_cols":11,"rows_kept":42,"cut":false,"hidden":false,"merged":[]}
[]
[]
[]
[null,null,null,null,null,null,null,null,"CANDIDATURAS","HOMBRES","MUJERES"]
[]
[]
[]
[null,null,null,null,null,null,null,null,"HEREDIA",49.650349650349654,50.349650349650354]
{"$rows_left_out":35}
{"sheet":"35","index":40,"n_rows":19,"n_cols":6,"rows_kept":19,"cut":false,"hidden":false,"merged":[[1,0,1,5],[2,0,2,5],[3,0,3,5],[4,0,4,5]]}
[]
["CUADRO 35"]
[" COSTA RICA: CANDIDATURAS INSCRITAS A DIPUTACIONES"]
["POR AÑO DE ELECCIÓN, SEGÚN PROVINCIA"]
["ELECCIONES GENERALES  2006 - 2022"]
[]
["PROVINCIA",2006,2010,2014,2018,2022]
[]
{"$rows_left_out":12}
{"sheet":"36","index":41,"n_rows":80,"n_cols":6,"rows_kept":80,"cut":false,"hidden":false,"merged":[[2,0,2,5],[3,0,3,5],[1,0,1,5]]}
[]
["CUADRO 36"]
[" COSTA RICA: CANDIDATURAS INSCRITAS A DIPUTACIONES POR AÑO DE ELECCIÓN, SEGÚN PARTIDO POLÍTICO"]
["ELECCIONES GENERALES 2006 - 2022"]
[]
["PARTIDO POLÍTICO",2006,2010,2014,2018,2022]
["COSTA RICA",{"$f":"SUM(B8:B79)","v":1167},{"$f":"SUM(C8:C79)","v":789},{"$f":"SUM(D8:D79)","v":1052},{"$f":"SUM(E8:E79)","v":1048},{"$f":"SUM(F8:F79)","v":1614}]
["ACCESIBILIDAD SIN EXCLUSIÓN",25,75,73,75,{"$f":"_xlfn.IFNA(VLOOKUP(A8,'30'!$A$12:$B$47,2,0),0)","v":64}]
{"$rows_left_out":72}